Reaction Details
TargetHigh affinity cAMP-specific 3',5'-cyclic phosphodiesterase 7A
LigandBDBM50042039
Substrate/Competitorn/a
Meas. Tech.ChEMBL_1443874 (CHEMBL3374135)
IC50 2.1±n/a nM
Citation Endo, YKawai, KAsano, TAmano, SAsanuma, YSawada, KOgura, KNagata, NUeo, NTakahashi, NSonoda, YKamei, N Discovery and SAR study of 2-(4-pyridylamino)thieno[3,2-d]pyrimidin-4(3H)-ones as soluble and highly potent PDE7 inhibitors. Bioorg Med Chem Lett25:649-53 (2015) 
 
High affinity cAMP-specific 3',5'-cyclic phosphodiesterase 7A
Name:High affinity cAMP-specific 3',5'-cyclic phosphodiesterase 7A
Type:Enzyme
Mol. Mass.:55514.96
Organism:Homo sapiens (Human)
Description:Q13946
Residue:482
BDBM50042039
NameBDBM50042039
Synonyms:CHEMBL3360167
TypeSmall organic molecule
Emp. Form.C16H17FN4O2S
Mol. Mass.348.395
SMILESCCn1c(Nc2ccncc2F)nc2c(csc2c1=O)C(C)(C)O