Reaction Details
TargetcAMP-specific 3',5'-cyclic phosphodiesterase 4B
LigandBDBM50042040
Substrate/Competitorn/a
Meas. Tech.ChEMBL_1443875 (CHEMBL3374136)
IC50 610±n/a nM
Citation Endo, YKawai, KAsano, TAmano, SAsanuma, YSawada, KOgura, KNagata, NUeo, NTakahashi, NSonoda, YKamei, N Discovery and SAR study of 2-(4-pyridylamino)thieno[3,2-d]pyrimidin-4(3H)-ones as soluble and highly potent PDE7 inhibitors. Bioorg Med Chem Lett25:649-53 (2015) 
 
cAMP-specific 3',5'-cyclic phosphodiesterase 4B
Name:cAMP-specific 3',5'-cyclic phosphodiesterase 4B
Type:Protein
Mol. Mass.:83318.87
Organism:Homo sapiens (Human)
Description:Q07343
Residue:736
BDBM50042040
NameBDBM50042040
Synonyms:CHEMBL3360166
TypeSmall organic molecule
Emp. Form.C15H15FN4O2S
Mol. Mass.334.369
SMILESCCn1c(Nc2ccncc2F)nc2c(csc2c1=O)C(C)O