Reaction Details
TargetcGMP-inhibited 3',5'-cyclic phosphodiesterase 3A
LigandBDBM50042036
Substrate/Competitorn/a
Meas. Tech.ChEMBL_1443878 (CHEMBL3374139)
IC50 29±n/a nM
Citation Endo, YKawai, KAsano, TAmano, SAsanuma, YSawada, KOgura, KNagata, NUeo, NTakahashi, NSonoda, YKamei, N Discovery and SAR study of 2-(4-pyridylamino)thieno[3,2-d]pyrimidin-4(3H)-ones as soluble and highly potent PDE7 inhibitors. Bioorg Med Chem Lett25:649-53 (2015) 
 
cGMP-inhibited 3',5'-cyclic phosphodiesterase 3A
Name:cGMP-inhibited 3',5'-cyclic phosphodiesterase 3A
Type:Enzyme
Mol. Mass.:124966.46
Organism:Homo sapiens (Human)
Description:Q14432
Residue:1141
BDBM50042036
NameBDBM50042036
Synonyms:CHEMBL3360170
TypeSmall organic molecule
Emp. Form.C20H22FN5O3S
Mol. Mass.431.484
SMILESCCn1c(Nc2ccncc2F)nc2c(csc2c1=O)C1CCCN(C1)C(=O)OC