Reaction Details
TargetcGMP-specific 3',5'-cyclic phosphodiesterase
LigandBDBM50042053
Substrate/Competitorn/a
Meas. Tech.ChEMBL_1443879 (CHEMBL3374140)
IC50 2900±n/a nM
Citation Endo, YKawai, KAsano, TAmano, SAsanuma, YSawada, KOgura, KNagata, NUeo, NTakahashi, NSonoda, YKamei, N Discovery and SAR study of 2-(4-pyridylamino)thieno[3,2-d]pyrimidin-4(3H)-ones as soluble and highly potent PDE7 inhibitors. Bioorg Med Chem Lett25:649-53 (2015) 
 
cGMP-specific 3',5'-cyclic phosphodiesterase
Name:cGMP-specific 3',5'-cyclic phosphodiesterase
Type:Protein
Mol. Mass.:99975.83
Organism:Homo sapiens (Human)
Description:O76074
Residue:875
BDBM50042053
NameBDBM50042053
Synonyms:CHEMBL3360172
TypeSmall organic molecule
Emp. Form.C23H23FN6O2S
Mol. Mass.466.531
SMILESCCn1c(Nc2ccncc2F)nc2c(csc2c1=O)C1CCCN(C1)C(=O)C1(CC1)C#N