Reaction Details
TargetD(3) dopamine receptor
LigandBDBM50042840
Substrate/Competitorn/a
Meas. Tech.ChEMBL_1444488 (CHEMBL3374188)
Ki 3.2±n/a nM
Citation Peng, XWang, QMishra, YXu, JReichert, DEMalik, MTaylor, MLuedtke, RRMach, RH Synthesis, pharmacological evaluation and molecular modeling studies of triazole containing dopamine D3 receptor ligands. Bioorg Med Chem Lett25:519-23 (2015) 
 
D(3) dopamine receptor
Name:D(3) dopamine receptor
Type:n/a
Mol. Mass.:44243.43
Organism:Homo sapiens (Human)
Description:n/a
Residue:400
BDBM50042840
NameBDBM50042840
Synonyms:CHEMBL3353905
TypeSmall organic molecule
Emp. Form.C24H30FN5O
Mol. Mass.423.5263
SMILESCOc1ccccc1N1CCN(CCCCCc2cn(nn2)-c2ccc(F)cc2)CC1