Reaction Details
TargetD(3) dopamine receptor
LigandBDBM50042728
Substrate/Competitorn/a
Meas. Tech.ChEMBL_1444488 (CHEMBL3374188)
Ki 6.8±n/a nM
Citation Peng, XWang, QMishra, YXu, JReichert, DEMalik, MTaylor, MLuedtke, RRMach, RH Synthesis, pharmacological evaluation and molecular modeling studies of triazole containing dopamine D3 receptor ligands. Bioorg Med Chem Lett25:519-23 (2015) 
 
D(3) dopamine receptor
Name:D(3) dopamine receptor
Type:n/a
Mol. Mass.:44243.43
Organism:Homo sapiens (Human)
Description:n/a
Residue:400
BDBM50042728
NameBDBM50042728
Synonyms:CHEMBL3353915
TypeSmall organic molecule
Emp. Form.C22H27N5O2
Mol. Mass.393.4821
SMILESCOc1ccccc1N1CCN(CCCc2cn(nn2)-c2ccccc2O)CC1