Reaction Details
Target5-hydroxytryptamine receptor 1A
LigandBDBM50339690
Substrate/Competitorn/a
Meas. Tech.ChEMBL_1444492 (CHEMBL3374192)
Ki 2.4±n/a nM
Citation Peng, XWang, QMishra, YXu, JReichert, DEMalik, MTaylor, MLuedtke, RRMach, RH Synthesis, pharmacological evaluation and molecular modeling studies of triazole containing dopamine D3 receptor ligands. Bioorg Med Chem Lett25:519-23 (2015) 
 
5-hydroxytryptamine receptor 1A
Name:5-hydroxytryptamine receptor 1A
Type:n/a
Mol. Mass.:46122.49
Organism:Homo sapiens (Human)
Description:n/a
Residue:422
BDBM50339690
NameBDBM50339690
Synonyms:4-(2-fluoroethyl)-N-(4-(4-(2-methoxyphenyl)piperazin-1-yl)butyl)benzamide | CHEMBL1688991
TypeSmall organic molecule
Emp. Form.C24H32FN3O2
Mol. Mass.413.5282
SMILESCOc1ccccc1N1CCN(CCCCNC(=O)c2ccc(CCF)cc2)CC1