Reaction Details
Target5-hydroxytryptamine receptor 1A
LigandBDBM50042844
Substrate/Competitorn/a
Meas. Tech.ChEMBL_1444492 (CHEMBL3374192)
Ki 1.3±n/a nM
Citation Peng, XWang, QMishra, YXu, JReichert, DEMalik, MTaylor, MLuedtke, RRMach, RH Synthesis, pharmacological evaluation and molecular modeling studies of triazole containing dopamine D3 receptor ligands. Bioorg Med Chem Lett25:519-23 (2015) 
 
5-hydroxytryptamine receptor 1A
Name:5-hydroxytryptamine receptor 1A
Type:n/a
Mol. Mass.:46122.49
Organism:Homo sapiens (Human)
Description:n/a
Residue:422
BDBM50042844
NameBDBM50042844
Synonyms:CHEMBL3353901
TypeSmall organic molecule
Emp. Form.C27H31N5OS
Mol. Mass.473.633
SMILESCOc1ccccc1N1CCN(CCCCc2cn(nn2)-c2ccc(cc2)-c2ccsc2)CC1