Reaction Details
TargetCannabinoid receptor 1
LigandBDBM50042893
Substrate/Competitorn/a
Meas. Tech.ChEMBL_1444652 (CHEMBL3376650)
EC50 13000±n/a nM
Citation Bartolozzi, ACirillo, PFBerry, AKHickey, ERThomson, DSWu, LZindell, RAlbrecht, CCeci, AGemkow, MJNagaraja, NVRomig, HSauer, ARiether, D Selective CB2 receptor agonists. Part 3: the optimization of a piperidine-based series that demonstrated efficacy in an in vivo neuropathic pain model. Bioorg Med Chem Lett25:587-92 (2015) 
 
Cannabinoid receptor 1
Name:Cannabinoid receptor 1
Type:G Protein-Coupled Receptor (GPCR)
Mol. Mass.:52868.96
Organism:Homo sapiens (Human)
Description:P21554
Residue:472
BDBM50042893
NameBDBM50042893
Synonyms:CHEMBL3354533
TypeSmall organic molecule
Emp. Form.C18H29N3O2
Mol. Mass.319.4418
SMILESCC(C)(C)c1cc(NC(=O)[C@@H]2CCCCN2C2CCCC2)no1