Reaction Details
TargetCannabinoid receptor 1
LigandBDBM50042899
Substrate/Competitorn/a
Meas. Tech.ChEMBL_1444652 (CHEMBL3376650)
EC50 217±n/a nM
Citation Bartolozzi, ACirillo, PFBerry, AKHickey, ERThomson, DSWu, LZindell, RAlbrecht, CCeci, AGemkow, MJNagaraja, NVRomig, HSauer, ARiether, D Selective CB2 receptor agonists. Part 3: the optimization of a piperidine-based series that demonstrated efficacy in an in vivo neuropathic pain model. Bioorg Med Chem Lett25:587-92 (2015) 
 
Cannabinoid receptor 1
Name:Cannabinoid receptor 1
Type:G Protein-Coupled Receptor (GPCR)
Mol. Mass.:52868.96
Organism:Homo sapiens (Human)
Description:P21554
Residue:472
BDBM50042899
NameBDBM50042899
Synonyms:CHEMBL3354529
TypeSmall organic molecule
Emp. Form.C20H26ClN3O2
Mol. Mass.375.892
SMILESCC(C)(C)c1cc(NC(=O)[C@@H]2CCCCN2Cc2ccc(Cl)cc2)no1