Reaction Details
TargetCannabinoid receptor 2
LigandBDBM50042902
Substrate/Competitorn/a
Meas. Tech.ChEMBL_1444651 (CHEMBL3376649)
EC50 33±n/a nM
Citation Bartolozzi, ACirillo, PFBerry, AKHickey, ERThomson, DSWu, LZindell, RAlbrecht, CCeci, AGemkow, MJNagaraja, NVRomig, HSauer, ARiether, D Selective CB2 receptor agonists. Part 3: the optimization of a piperidine-based series that demonstrated efficacy in an in vivo neuropathic pain model. Bioorg Med Chem Lett25:587-92 (2015) 
 
Cannabinoid receptor 2
Name:Cannabinoid receptor 2
Type:G Protein-Coupled Receptor (GPCR)
Mol. Mass.:39690.94
Organism:Homo sapiens (Human)
Description:P34972
Residue:360
BDBM50042902
NameBDBM50042902
Synonyms:CHEMBL3354563
TypeSmall organic molecule
Emp. Form.C19H23N5O4S2
Mol. Mass.449.547
SMILESO=C(Nc1nc(ns1)-c1ccccc1)[C@@H]1CCCCN1C(=O)N1CCS(=O)(=O)CC1