Reaction Details
TargetCannabinoid receptor 2
LigandBDBM50042905
Substrate/Competitorn/a
Meas. Tech.ChEMBL_1444651 (CHEMBL3376649)
EC50 34±n/a nM
Citation Bartolozzi, ACirillo, PFBerry, AKHickey, ERThomson, DSWu, LZindell, RAlbrecht, CCeci, AGemkow, MJNagaraja, NVRomig, HSauer, ARiether, D Selective CB2 receptor agonists. Part 3: the optimization of a piperidine-based series that demonstrated efficacy in an in vivo neuropathic pain model. Bioorg Med Chem Lett25:587-92 (2015) 
 
Cannabinoid receptor 2
Name:Cannabinoid receptor 2
Type:G Protein-Coupled Receptor (GPCR)
Mol. Mass.:39690.94
Organism:Homo sapiens (Human)
Description:P34972
Residue:360
BDBM50042905
NameBDBM50042905
Synonyms:CHEMBL3354560
TypeSmall organic molecule
Emp. Form.C20H24N4O4S2
Mol. Mass.448.559
SMILESO=C(Nc1nc(cs1)-c1ccccc1)[C@@H]1CCCCN1C(=O)N1CCS(=O)(=O)CC1