Reaction Details
TargetCannabinoid receptor 2
LigandBDBM50042896
Substrate/Competitorn/a
Meas. Tech.ChEMBL_1444651 (CHEMBL3376649)
EC50 1.5±n/a nM
Citation Bartolozzi, ACirillo, PFBerry, AKHickey, ERThomson, DSWu, LZindell, RAlbrecht, CCeci, AGemkow, MJNagaraja, NVRomig, HSauer, ARiether, D Selective CB2 receptor agonists. Part 3: the optimization of a piperidine-based series that demonstrated efficacy in an in vivo neuropathic pain model. Bioorg Med Chem Lett25:587-92 (2015) 
 
Cannabinoid receptor 2
Name:Cannabinoid receptor 2
Type:G Protein-Coupled Receptor (GPCR)
Mol. Mass.:39690.94
Organism:Homo sapiens (Human)
Description:P34972
Residue:360
BDBM50042896
NameBDBM50042896
Synonyms:CHEMBL3354532
TypeSmall organic molecule
Emp. Form.C17H29N3O2
Mol. Mass.307.4311
SMILESCC(C)CN1CCCC[C@H]1C(=O)Nc1cc(on1)C(C)(C)C