Reaction Details
TargetCannabinoid receptor 1
LigandBDBM50042904
Substrate/Competitorn/a
Meas. Tech.ChEMBL_1444652 (CHEMBL3376650)
EC50>20000±n/a nM
Citation Bartolozzi, ACirillo, PFBerry, AKHickey, ERThomson, DSWu, LZindell, RAlbrecht, CCeci, AGemkow, MJNagaraja, NVRomig, HSauer, ARiether, D Selective CB2 receptor agonists. Part 3: the optimization of a piperidine-based series that demonstrated efficacy in an in vivo neuropathic pain model. Bioorg Med Chem Lett25:587-92 (2015) 
 
Cannabinoid receptor 1
Name:Cannabinoid receptor 1
Type:G Protein-Coupled Receptor (GPCR)
Mol. Mass.:52868.96
Organism:Homo sapiens (Human)
Description:P21554
Residue:472
BDBM50042904
NameBDBM50042904
Synonyms:CHEMBL3354561
TypeSmall organic molecule
Emp. Form.C18H21ClN4O4S2
Mol. Mass.456.967
SMILESClc1ccc2sc(NC(=O)[C@@H]3CCCCN3C(=O)N3CCS(=O)(=O)CC3)nc2c1