Reaction Details
TargetCytochrome P450 2D6
LigandBDBM50042912
Substrate/Competitorn/a
Meas. Tech.ChEMBL_1444660 (CHEMBL3376658)
IC50>30000±n/a nM
Citation Bartolozzi, ACirillo, PFBerry, AKHickey, ERThomson, DSWu, LZindell, RAlbrecht, CCeci, AGemkow, MJNagaraja, NVRomig, HSauer, ARiether, D Selective CB2 receptor agonists. Part 3: the optimization of a piperidine-based series that demonstrated efficacy in an in vivo neuropathic pain model. Bioorg Med Chem Lett25:587-92 (2015) 
 
Cytochrome P450 2D6
Name:Cytochrome P450 2D6
Type:Protein
Mol. Mass.:55774.82
Organism:Homo sapiens (Human)
Description:P10635
Residue:497
BDBM50042912
NameBDBM50042912
Synonyms:CHEMBL3354553
TypeSmall organic molecule
Emp. Form.C18H28N4O5S
Mol. Mass.412.504
SMILESCC(C)(C)c1cc(NC(=O)[C@@H]2CCCCN2C(=O)N2CCS(=O)(=O)CC2)no1