Reaction Details
TargetRho-associated protein kinase 2
LigandBDBM50044004
Substrate/Competitorn/a
Meas. Tech.ChEMBL_1445339 (CHEMBL3378491)
IC50 340±n/a nM
Citation Harrison, BAAlmstead, ZYBurgoon, HGardyan, MGoodwin, NCHealy, JLiu, YMabon, RMarinelli, BSamala, LZhang, YStouch, TRWhitlock, NAGopinathan, SMcKnight, BWang, SPatel, NWilson, AGHamman, BDRice, DSRawlins, DB Discovery and Development of LX7101, a Dual LIM-Kinase and ROCK Inhibitor for the Treatment of Glaucoma. ACS Med Chem Lett6:84-8 (2015) 
 
Rho-associated protein kinase 2
Name:Rho-associated protein kinase 2
Type:Protein
Mol. Mass.:160885.43
Organism:Homo sapiens (Human)
Description:O75116
Residue:1388
BDBM50044004
NameBDBM50044004
Synonyms:CHEMBL3356433
TypeSmall organic molecule
Emp. Form.C23H29N7O3
Mol. Mass.451.5215
SMILESCN(C)C(=O)Oc1cccc(NC(=O)C2(CN)CCN(CC2)c2ncnc3[nH]cc(C)c23)c1