Reaction Details
TargetNuclear receptor ROR-gamma
LigandBDBM50445876
Substrate/Competitorn/a
Meas. Tech.ChEMBL_1457058 (CHEMBL3369179)
EC50 6.0±n/a nM
Citation Fauber, BPMagnuson, S Modulators of the nuclear receptor retinoic acid receptor-related orphan receptor-¿ (ROR¿ or RORc). J Med Chem57:5871-92 (2014) 
 
Nuclear receptor ROR-gamma
Name:Nuclear receptor ROR-gamma
Type:Enzyme Catalytic Domain
Mol. Mass.:58218.40
Organism:Homo sapiens (Human)
Description:P51449
Residue:518
BDBM50445876
NameBDBM50445876
Synonyms:CHEMBL3105692
TypeSmall organic molecule
Emp. Form.C27H21Cl2NO4S2
Mol. Mass.558.496
SMILESCCS(=O)(=O)c1ccc(CC(=O)Nc2cc(c(s2)C(=O)c2ccccc2Cl)-c2cccc(Cl)c2)cc1