Reaction Details
TargetNuclear receptor ROR-gamma
LigandBDBM50061615
Substrate/Competitorn/a
Meas. Tech.ChEMBL_1457058 (CHEMBL3369179)
EC50 4000±n/a nM
Citation Fauber, BPMagnuson, S Modulators of the nuclear receptor retinoic acid receptor-related orphan receptor-¿ (ROR¿ or RORc). J Med Chem57:5871-92 (2014) 
 
Nuclear receptor ROR-gamma
Name:Nuclear receptor ROR-gamma
Type:Enzyme Catalytic Domain
Mol. Mass.:58218.40
Organism:Homo sapiens (Human)
Description:P51449
Residue:518
BDBM50061615
NameBDBM50061615
Synonyms:4-(10,10,13,13,15-Pentamethyl-11,12,13,15-tetrahydro-10H-8,15-diaza-cyclohepta[2,1-a;4,5-b']dinaphthalen-7-yl)-benzoic acid | CHEMBL298373
TypeSmall organic molecule
Emp. Form.C33H32N2O2
Mol. Mass.488.6194
SMILESCN1c2cc3c(cc2N=C(c2ccc(cc2)C(O)=O)c2ccc4ccccc4c12)C(C)(C)CCC3(C)C