Reaction Details
TargetTranscription factor Jun
LigandBDBM50044557
Substrate/Competitorn/a
Meas. Tech.ChEMBL_1458012 (CHEMBL3367186)
IC50 1500±n/a nM
Citation Ye, NDing, YWild, CShen, QZhou, J Small molecule inhibitors targeting activator protein 1 (AP-1). J Med Chem57:6930-48 (2014) 
 
Transcription factor Jun
Name:Transcription factor Jun
Type:n/a
Mol. Mass.:35683.24
Organism:Homo sapiens (Human)
Description:P05412
Residue:331
BDBM50044557
NameBDBM50044557
Synonyms:NAGILACTONE
TypeSmall organic molecule
Emp. Form.C19H22O7
Mol. Mass.362.3738
SMILESCC(C)c1oc(=O)cc2c1C(O)C1OC(=O)C3(C)C1C2(C)C1OC1C3O