Reaction Details
TargetTranscription factor Jun
LigandBDBM50044575
Substrate/Competitorn/a
Meas. Tech.ChEMBL_1457997 (CHEMBL3367171)
IC50 8500±n/a nM
Citation Ye, NDing, YWild, CShen, QZhou, J Small molecule inhibitors targeting activator protein 1 (AP-1). J Med Chem57:6930-48 (2014) 
 
Transcription factor Jun
Name:Transcription factor Jun
Type:n/a
Mol. Mass.:35683.24
Organism:Homo sapiens (Human)
Description:P05412
Residue:331
BDBM50044575
NameBDBM50044575
Synonyms:CHEMBL3341909
TypeSmall organic molecule
Emp. Form.C13H7ClF3N3O
Mol. Mass.313.662
SMILESFC(F)(F)c1ccc2Cc3nc(Cl)ncc3C(=O)Nc2c1