Reaction Details
TargetTranscription factor Jun
LigandBDBM50044577
Substrate/Competitorn/a
Meas. Tech.ChEMBL_1457997 (CHEMBL3367171)
IC50 6100±n/a nM
Citation Ye, NDing, YWild, CShen, QZhou, J Small molecule inhibitors targeting activator protein 1 (AP-1). J Med Chem57:6930-48 (2014) 
 
Transcription factor Jun
Name:Transcription factor Jun
Type:n/a
Mol. Mass.:35683.24
Organism:Homo sapiens (Human)
Description:P05412
Residue:331
BDBM50044577
NameBDBM50044577
Synonyms:CHEMBL3341908
TypeSmall organic molecule
Emp. Form.C12H5ClF3N3O
Mol. Mass.299.636
SMILESFC(F)(F)c1ccc2c(c1)[nH]c(=O)c1cnc(Cl)nc21