Reaction Details
TargetTranscription factor Jun
LigandBDBM50092884
Substrate/Competitorn/a
Meas. Tech.ChEMBL_1457997 (CHEMBL3367171)
IC50>30000±n/a nM
Citation Ye, NDing, YWild, CShen, QZhou, J Small molecule inhibitors targeting activator protein 1 (AP-1). J Med Chem57:6930-48 (2014) 
 
Transcription factor Jun
Name:Transcription factor Jun
Type:n/a
Mol. Mass.:35683.24
Organism:Homo sapiens (Human)
Description:P05412
Residue:331
BDBM50092884
NameBDBM50092884
Synonyms:CHEMBL132457 | N-(3,5-Bis-trifluoromethyl-phenyl)-4-chloro-2-trifluoromethyl-benzamide
TypeSmall organic molecule
Emp. Form.C16H7ClF9NO
Mol. Mass.435.672
SMILESFC(F)(F)c1cc(NC(=O)c2ccc(Cl)cc2C(F)(F)F)cc(c1)C(F)(F)F