Reaction Details
TargetCannabinoid receptor 2
LigandBDBM50445614
Substrate/Competitorn/a
Meas. Tech.ChEMBL_1450024 (CHEMBL3373286)
Ki>10000±n/a nM
Citation Rajagopalan, PTracey, HChen, ZBandyopadhyaya, AVeeraraghavan, SRajagopalan, DRSalvemini, DMcPhee, IViswanadha, SRajagopalan, R DDD-028: a potent potential non-opioid, non-cannabinoid analgesic for neuropathic and inflammatory pain. Bioorg Med Chem Lett24:3088-91 (2014) 
 
Cannabinoid receptor 2
Name:Cannabinoid receptor 2
Type:G Protein-Coupled Receptor (GPCR)
Mol. Mass.:39690.94
Organism:Homo sapiens (Human)
Description:P34972
Residue:360
BDBM50445614
NameBDBM50445614
Synonyms:CHEMBL3104093
TypeSmall organic molecule
Emp. Form.C20H20N2
Mol. Mass.288.3862
SMILESCN1CCc2c(C1)c1cccc3-c4ccccc4CCn2c13