Reaction Details
TargetCytochrome P450 2C9
LigandBDBM50437841
Substrate/Competitorn/a
Meas. Tech.ChEMBL_1450855 (CHEMBL3364614)
IC50 1600±n/a nM
Citation Sampson, PBLiu, YPatel, NKFeher, MForrest, BLi, SWEdwards, LLaufer, RLang, YBan, FAwrey, DEMao, GPlotnikova, OLeung, GHodgson, RMason, JMWei, XKiarash, RGreen, EQiu, WChirgadze, NYMak, TWPan, GPauls, HW The discovery of Polo-like kinase 4 inhibitors: design and optimization of spiro[cyclopropane-1,3'[3H]indol]-2'(1'H).ones as orally bioavailable antitumor agents. J Med Chem58:130-46 (2015) 
 
Cytochrome P450 2C9
Name:Cytochrome P450 2C9
Type:Enzyme
Mol. Mass.:55636.33
Organism:Homo sapiens (Human)
Description:P11712
Residue:490
BDBM50437841
NameBDBM50437841
Synonyms:CHEMBL2407900
TypeSmall organic molecule
Emp. Form.C29H28N6O2
Mol. Mass.492.5716
SMILESCOc1ccc2NC(=O)\C(=C\c3ccc4c(\C=C\c5ccc(nc5)N5CCN(C)CC5)n[nH]c4c3)c2c1