Reaction Details
TargetCytochrome P450 1A2
LigandBDBM50437837
Substrate/Competitorn/a
Meas. Tech.ChEMBL_1450854 (CHEMBL3364613)
IC50>10000±n/a nM
Citation Sampson, PBLiu, YPatel, NKFeher, MForrest, BLi, SWEdwards, LLaufer, RLang, YBan, FAwrey, DEMao, GPlotnikova, OLeung, GHodgson, RMason, JMWei, XKiarash, RGreen, EQiu, WChirgadze, NYMak, TWPan, GPauls, HW The discovery of Polo-like kinase 4 inhibitors: design and optimization of spiro[cyclopropane-1,3'[3H]indol]-2'(1'H).ones as orally bioavailable antitumor agents. J Med Chem58:130-46 (2015) 
 
Cytochrome P450 1A2
Name:Cytochrome P450 1A2
Type:Enzyme
Mol. Mass.:58423.38
Organism:Homo sapiens (Human)
Description:P05177
Residue:516
BDBM50437837
NameBDBM50437837
Synonyms:CHEMBL2407897
TypeSmall organic molecule
Emp. Form.C27H24N4O
Mol. Mass.420.5057
SMILESCN(C)Cc1ccc(\C=C\c2n[nH]c3cc(\C=C4\C(=O)Nc5ccccc45)ccc23)cc1