Reaction Details
TargetSerine/threonine-protein kinase PLK4
LigandBDBM50437837
Substrate/Competitorn/a
Meas. Tech.ChEMBL_1450851 (CHEMBL3364610)
IC50 4.0±n/a nM
Citation Sampson, PBLiu, YPatel, NKFeher, MForrest, BLi, SWEdwards, LLaufer, RLang, YBan, FAwrey, DEMao, GPlotnikova, OLeung, GHodgson, RMason, JMWei, XKiarash, RGreen, EQiu, WChirgadze, NYMak, TWPan, GPauls, HW The discovery of Polo-like kinase 4 inhibitors: design and optimization of spiro[cyclopropane-1,3'[3H]indol]-2'(1'H).ones as orally bioavailable antitumor agents. J Med Chem58:130-46 (2015) 
 
Serine/threonine-protein kinase PLK4
Name:Serine/threonine-protein kinase PLK4
Type:PROTEIN
Mol. Mass.:108996.91
Organism:Homo sapiens (Human)
Description:ChEMBL_1474078
Residue:970
BDBM50437837
NameBDBM50437837
Synonyms:CHEMBL2407897
TypeSmall organic molecule
Emp. Form.C27H24N4O
Mol. Mass.420.5057
SMILESCN(C)Cc1ccc(\C=C\c2n[nH]c3cc(\C=C4\C(=O)Nc5ccccc45)ccc23)cc1