Reaction Details
TargetSerine/threonine-protein kinase PLK4
LigandBDBM50044673
Substrate/Competitorn/a
Meas. Tech.ChEMBL_1450851 (CHEMBL3364610)
IC50 2.0±n/a nM
Citation Sampson, PBLiu, YPatel, NKFeher, MForrest, BLi, SWEdwards, LLaufer, RLang, YBan, FAwrey, DEMao, GPlotnikova, OLeung, GHodgson, RMason, JMWei, XKiarash, RGreen, EQiu, WChirgadze, NYMak, TWPan, GPauls, HW The discovery of Polo-like kinase 4 inhibitors: design and optimization of spiro[cyclopropane-1,3'[3H]indol]-2'(1'H).ones as orally bioavailable antitumor agents. J Med Chem58:130-46 (2015) 
 
Serine/threonine-protein kinase PLK4
Name:Serine/threonine-protein kinase PLK4
Type:PROTEIN
Mol. Mass.:108996.91
Organism:Homo sapiens (Human)
Description:ChEMBL_1474078
Residue:970
BDBM50044673
NameBDBM50044673
Synonyms:CHEMBL3353353 | US10358436, Example A167
TypeSmall organic molecule
Emp. Form.C30H30N4O
Mol. Mass.462.5854
SMILESCCc1ccc2NC(=O)[C@@]3(C[C@H]3c3ccc4c(\C=C\c5ccc(CN(C)C)cc5)n[nH]c4c3)c2c1