Reaction Details
TargetSerine/threonine-protein kinase PLK4
LigandBDBM50044660
Substrate/Competitorn/a
Meas. Tech.ChEMBL_1450851 (CHEMBL3364610)
IC50 1.6±n/a nM
Citation Sampson, PBLiu, YPatel, NKFeher, MForrest, BLi, SWEdwards, LLaufer, RLang, YBan, FAwrey, DEMao, GPlotnikova, OLeung, GHodgson, RMason, JMWei, XKiarash, RGreen, EQiu, WChirgadze, NYMak, TWPan, GPauls, HW The discovery of Polo-like kinase 4 inhibitors: design and optimization of spiro[cyclopropane-1,3'[3H]indol]-2'(1'H).ones as orally bioavailable antitumor agents. J Med Chem58:130-46 (2015) 
 
Serine/threonine-protein kinase PLK4
Name:Serine/threonine-protein kinase PLK4
Type:PROTEIN
Mol. Mass.:108996.91
Organism:Homo sapiens (Human)
Description:ChEMBL_1474078
Residue:970
BDBM50044660
NameBDBM50044660
Synonyms:CHEMBL3353342 US9907800, Example A29
TypeSmall organic molecule
Emp. Form.C24H18N4O
Mol. Mass.378.4259
SMILESO=C1Nc2ccccc2[C@]11C[C@H]1c1ccc2c(\C=C\c3cccnc3)n[nH]c2c1