Reaction Details
TargetVasopressin V1b receptor
LigandBDBM50044778
Substrate/Competitorn/a
Meas. Tech.ChEMBL_1451729 (CHEMBL3366922)
EC50>10.0±n/a nM
Citation Wisniewski, KAlagarsamy, SGalyean, RTariga, HThompson, DLy, BWisniewska, HQi, SCroston, GLaporte, RRivière, PJSchteingart, CD New, potent, and selective peptidic oxytocin receptor agonists. J Med Chem57:5306-17 (2014) 
 
Vasopressin V1b receptor
Name:Vasopressin V1b receptor
Type:Enzyme
Mol. Mass.:46985.01
Organism:Homo sapiens (Human)
Description:P47901
Residue:424
BDBM50044778
NameBDBM50044778
Synonyms:CHEMBL3353937
TypeSmall organic molecule
Emp. Form.C42H65N11O12S
Mol. Mass.948.097
SMILES[H][C@]1(NC(=O)[C@H](Cc2ccc(OC)cc2)NC(=O)CCCSC[C@H](NC(=O)[C@H](CC(N)=O)NC(=O)[C@H](CCC(N)=O)NC1=O)C(=O)NCC(=O)N[C@@H](CC(C)C)C(=O)NCC(N)=O)[C@@H](C)CC