Reaction Details
TargetVasopressin V1b receptor
LigandBDBM50044777
Substrate/Competitorn/a
Meas. Tech.ChEMBL_1451729 (CHEMBL3366922)
EC50 4.3±n/a nM
Citation Wisniewski, KAlagarsamy, SGalyean, RTariga, HThompson, DLy, BWisniewska, HQi, SCroston, GLaporte, RRivière, PJSchteingart, CD New, potent, and selective peptidic oxytocin receptor agonists. J Med Chem57:5306-17 (2014) 
 
Vasopressin V1b receptor
Name:Vasopressin V1b receptor
Type:Enzyme
Mol. Mass.:46985.01
Organism:Homo sapiens (Human)
Description:P47901
Residue:424
BDBM50044777
NameBDBM50044777
Synonyms:Arginine Vasopressin CHEBI:34543 Pitressin Vasopressin
TypeSmall organic molecule
Emp. Form.C46H65N15O12S2
Mol. Mass.1084.232
SMILESN[C@H]1CSSC[C@H](NC(=O)[C@H](CC(N)=O)NC(=O)[C@H](CCC(N)=O)NC(=O)[C@H](Cc2ccccc2)NC(=O)[C@H](Cc2ccc(O)cc2)NC1=O)C(=O)N1CCC[C@H]1C(=O)N[C@@H](CCCNC(N)=N)C(=O)NCC(N)=O