Reaction Details
TargetMalate dehydrogenase
LigandBDBM50044971
Substrate/Competitorn/a
Meas. Tech.ChEMBL_1448377 (CHEMBL3376861)
IC50 1000±n/a nM
Citation Zinglé, CTritsch, DGrosdemange-Billiard, CRohmer, M Catechol-rhodanine derivatives: Specific and promiscuous inhibitors of Escherichia coli deoxyxylulose phosphate reductoisomerase (DXR). Bioorg Med Chem22:3713-9 (2014) 
 
Malate dehydrogenase
Name:Malate dehydrogenase
Type:PROTEIN
Mol. Mass.:35423.44
Organism:Thermus thermophilus
Description:ChEMBL_1448377
Residue:327
BDBM50044971
NameBDBM50044971
Synonyms:CHEMBL3309760
TypeSmall organic molecule
Emp. Form.C25H20N2O5S2
Mol. Mass.492.567
SMILESCc1ccc(Oc2ccc(NC(=O)CN3C(=S)S\C(=C/c4cccc(O)c4O)C3=O)cc2)cc1