Reaction Details
TargetKiSS-1 receptor
LigandBDBM50045507
Substrate/Competitorn/a
Meas. Tech.ChEMBL_1448385 (CHEMBL3376869)
Ki 0.036000±n/a nM
Citation Asami, TNishizawa, NMatsui, HTakatsu, YSuzuki, AKiba, ATerada, MNishibori, KNakayama, MBan, JMatsumoto, STarui, NIkeda, YYamaguchi, MKusaka, MOhtaki, TKitada, C Physicochemically and pharmacokinetically stable nonapeptide KISS1 receptor agonists with highly potent testosterone-suppressive activity. J Med Chem57:6105-15 (2014) 
 
KiSS-1 receptor
Name:KiSS-1 receptor
Type:G Protein-Coupled Receptor (GPCR)
Mol. Mass.:42613.79
Organism:Homo sapiens (Human)
Description:Binding assay was performed using membranes from the CHO cell transfectants.
Residue:398
BDBM50045507
NameBDBM50045507
Synonyms:CHEMBL3314224
TypeSmall organic molecule
Emp. Form.C64H83N17O13
Mol. Mass.1298.4499
SMILESCNC(=N)NCCC[C@H](NC(=O)[C@H](CC(C)C)NC(=O)NNC(=O)[C@H](Cc1ccccc1)NC(=O)[C@@H](NC(=O)[C@H](CC(N)=O)NC(=O)[C@@H](Cc1c[nH]c2ccccc12)NC(=O)[C@@H](Cc1ccc(O)cc1)NC(C)=O)[C@@H](C)O)C(=O)N[C@@H](Cc1c[nH]c2ccccc12)C(N)=O