Reaction Details
TargetKiSS-1 receptor
LigandBDBM50045517
Substrate/Competitorn/a
Meas. Tech.ChEMBL_1448383 (CHEMBL3376867)
EC50 12±n/a nM
Citation Asami, TNishizawa, NMatsui, HTakatsu, YSuzuki, AKiba, ATerada, MNishibori, KNakayama, MBan, JMatsumoto, STarui, NIkeda, YYamaguchi, MKusaka, MOhtaki, TKitada, C Physicochemically and pharmacokinetically stable nonapeptide KISS1 receptor agonists with highly potent testosterone-suppressive activity. J Med Chem57:6105-15 (2014) 
 
KiSS-1 receptor
Name:KiSS-1 receptor
Type:PROTEIN
Mol. Mass.:42915.37
Organism:Rattus norvegicus
Description:ChEMBL_1448383
Residue:396
BDBM50045517
NameBDBM50045517
Synonyms:CHEMBL3314209
TypeSmall organic molecule
Emp. Form.C60H81N17O11
Mol. Mass.1216.3924
SMILESCNC(=N)NCCC[C@H](NC(=O)[C@H](CC(C)C)NC(=O)NNC(=O)[C@H](Cc1ccccc1)NC(=O)[C@@H](NC(=O)[C@H](CC(N)=O)NC(=O)[C@@H](Cc1ccncc1)NC(=O)[C@H](N)Cc1ccc(O)cc1)C(C)C)C(=O)N[C@@H](Cc1c[nH]c2ccccc12)C(N)=O