Reaction Details
TargetSodium channel protein type 5 subunit alpha
LigandBDBM50045831
Substrate/Competitorn/a
Meas. Tech.ChEMBL_1456350 (CHEMBL3368359)
IC50>33000±n/a nM
Citation Georgsson, JBergström, FNordqvist, AWatson, MJBlundell, CDJohansson, MJPetersson, AUYuan, ZQZhou, YKristensson, LKakol-Palm, DTyrchan, CWellner, EBauer, UBrodin, PSvensson Henriksson, A GPR103 antagonists demonstrating anorexigenic activity in vivo: design and development of pyrrolo[2,3-c]pyridines that mimic the C-terminal Arg-Phe motif of QRFP26. J Med Chem57:5935-48 (2014) 
 
Sodium channel protein type 5 subunit alpha
Name:Sodium channel protein type 5 subunit alpha
Type:Enzyme
Mol. Mass.:226908.60
Organism:Homo sapiens (Human)
Description:Q14524
Residue:2016
BDBM50045831
NameBDBM50045831
Synonyms:CHEMBL3314352
TypeSmall organic molecule
Emp. Form.C21H23BrN4O
Mol. Mass.427.338
SMILESCN(C)Cc1ccc2CN(CCc2c1)C(=O)c1cc2cc(Br)ncc2n1C