Reaction Details
TargetPotassium voltage-gated channel subfamily H member 2
LigandBDBM50045830
Substrate/Competitorn/a
Meas. Tech.ChEMBL_1456349 (CHEMBL3368358)
IC50 12900±n/a nM
Citation Georgsson, JBergström, FNordqvist, AWatson, MJBlundell, CDJohansson, MJPetersson, AUYuan, ZQZhou, YKristensson, LKakol-Palm, DTyrchan, CWellner, EBauer, UBrodin, PSvensson Henriksson, A GPR103 antagonists demonstrating anorexigenic activity in vivo: design and development of pyrrolo[2,3-c]pyridines that mimic the C-terminal Arg-Phe motif of QRFP26. J Med Chem57:5935-48 (2014) 
 
Potassium voltage-gated channel subfamily H member 2
Name:Potassium voltage-gated channel subfamily H member 2
Type:Multi-pass membrane protein
Mol. Mass.:126672.65
Organism:Homo sapiens (Human)
Description:Q12809
Residue:1159
BDBM50045830
NameBDBM50045830
Synonyms:CHEMBL3314362
TypeSmall organic molecule
Emp. Form.C23H26ClN3O
Mol. Mass.395.925
SMILESCN(C)Cc1cc2CCN(Cc2cc1C)C(=O)c1cc2cc(Cl)ccc2n1C