Reaction Details
TargetPyroglutamylated RF-amide peptide receptor
LigandBDBM50045840
Substrate/Competitorn/a
Meas. Tech.ChEMBL_1456340 (CHEMBL3368108)
IC50 3300±n/a nM
Citation Georgsson, JBergström, FNordqvist, AWatson, MJBlundell, CDJohansson, MJPetersson, AUYuan, ZQZhou, YKristensson, LKakol-Palm, DTyrchan, CWellner, EBauer, UBrodin, PSvensson Henriksson, A GPR103 antagonists demonstrating anorexigenic activity in vivo: design and development of pyrrolo[2,3-c]pyridines that mimic the C-terminal Arg-Phe motif of QRFP26. J Med Chem57:5935-48 (2014) 
 
Pyroglutamylated RF-amide peptide receptor
Name:Pyroglutamylated RF-amide peptide receptor
Type:Enzyme Catalytic Domain
Mol. Mass.:49508.46
Organism:Homo sapiens (Human)
Description:GPR103 0 HUMAN::Q96P65
Residue:431
BDBM50045840
NameBDBM50045840
Synonyms:CHEMBL3314356
TypeSmall organic molecule
Emp. Form.C22H23F3N4O
Mol. Mass.416.4394
SMILESCN(C)Cc1ccc2CN(CCc2c1)C(=O)c1cc2cc(ncc2n1C)C(F)(F)F