Reaction Details
TargetTransient receptor potential cation channel subfamily V member 1
LigandBDBM50046286
Substrate/Competitorn/a
Meas. Tech.ChEMBL_1447592 (CHEMBL3373787)
Ki 1.000000±n/a nM
Citation Ryu, HSeo, SCho, SHKim, HSJung, AKang, DWSon, KCui, MHong, SHSharma, PKChoi, SBlumberg, PMFrank-Foltyn, RBahrenberg, GStockhausen, HSchiene, KChristoph, TFrormann, SLee, J 2-Alkyl/alkenyl substituted pyridine C-region analogues of 2-(3-fluoro-4-methylsulfonylaminophenyl)propanamides as highly potent TRPV1 antagonists. Bioorg Med Chem Lett24:4039-43 (2014) 
 
Transient receptor potential cation channel subfamily V member 1
Name:Transient receptor potential cation channel subfamily V member 1
Type:Protein
Mol. Mass.:94960.75
Organism:Homo sapiens (Human)
Description:Q8NER1
Residue:839
BDBM50046286
NameBDBM50046286
Synonyms:CHEMBL3313936
TypeSmall organic molecule
Emp. Form.C22H27F4N3O3S
Mol. Mass.489.527
SMILESCCCCCc1nc(ccc1CNC(=O)C(C)c1ccc(NS(C)(=O)=O)c(F)c1)C(F)(F)F