Reaction Details
TargetCoagulation factor X
LigandBDBM50046521
Substrate/Competitorn/a
Meas. Tech.ChEMBL_1449322 (CHEMBL3371468)
Ki 0.070000±n/a nM
Citation Orwat, MJQiao, JXHe, KRendina, ARLuettgen, JMRossi, KAXin, BKnabb, RMWexler, RRLam, PYPinto, DJ Orally bioavailable factor Xa inhibitors containing alpha-substituted gem-dimethyl P4 moieties. Bioorg Med Chem Lett24:3341-5 (2014) 
 
Coagulation factor X
Name:Coagulation factor X
Type:Enzyme
Mol. Mass.:54726.60
Organism:Homo sapiens (Human)
Description:n/a
Residue:488
BDBM50046521
NameBDBM50046521
Synonyms:CHEMBL3314454
TypeSmall organic molecule
Emp. Form.C27H31N5O3
Mol. Mass.473.5667
SMILESCOc1ccc(cc1)-n1nc(C(N)=O)c2CCN(C(=O)c12)c1ccc(cc1)C(C)(C)N1CCCC1