Reaction Details
TargetUDP-N-acetylmuramoylalanine--D-glutamate ligase
LigandBDBM50046816
Substrate/Competitorn/a
Meas. Tech.ChEMBL_1452802 (CHEMBL3365144)
IC50 95000±n/a nM
Citation Perdih, AHrast, MBarreteau, HGobec, SWolber, GSolmajer, T Benzene-1,3-dicarboxylic acid 2,5-dimethylpyrrole derivatives as multiple inhibitors of bacterial Mur ligases (MurC-MurF). Bioorg Med Chem22:4124-34 (2014) 
 
UDP-N-acetylmuramoylalanine--D-glutamate ligase
Name:UDP-N-acetylmuramoylalanine--D-glutamate ligase
Type:Ligase
Mol. Mass.:46963.02
Organism:Escherichia coli (strain K12)
Description:n/a
Residue:438
BDBM50046816
NameBDBM50046816
Synonyms:CHEMBL3310459
TypeSmall organic molecule
Emp. Form.C18H14N2O5S2
Mol. Mass.402.444
SMILESCc1cc(\C=C2\SC(=S)NC2=O)c(C)n1-c1cc(cc(c1)C(O)=O)C(O)=O