Reaction Details
TargetUDP-N-acetylmuramoyl-tripeptide--D-alanyl-D-alanine ligase
LigandBDBM50046815
Substrate/Competitorn/a
Meas. Tech.ChEMBL_1452798 (CHEMBL3365140)
IC50 298000±n/a nM
Citation Perdih, AHrast, MBarreteau, HGobec, SWolber, GSolmajer, T Benzene-1,3-dicarboxylic acid 2,5-dimethylpyrrole derivatives as multiple inhibitors of bacterial Mur ligases (MurC-MurF). Bioorg Med Chem22:4124-34 (2014) 
 
UDP-N-acetylmuramoyl-tripeptide--D-alanyl-D-alanine ligase
Name:UDP-N-acetylmuramoyl-tripeptide--D-alanyl-D-alanine ligase
Type:Protein
Mol. Mass.:47439.03
Organism:Escherichia coli
Description:P11880
Residue:452
BDBM50046815
NameBDBM50046815
Synonyms:CHEMBL3310461
TypeSmall organic molecule
Emp. Form.C24H19N3O5S
Mol. Mass.461.49
SMILESCc1cc(\C=C2\S\C(NC2=O)=N\c2ccccc2)c(C)n1-c1cc(cc(c1)C(O)=O)C(O)=O