Reaction Details
TargetUDP-N-acetylmuramoyl-L-alanyl-D-glutamate--2,6-diaminopimelate ligase
LigandBDBM50046817
Substrate/Competitorn/a
Meas. Tech.ChEMBL_1452800 (CHEMBL3365142)
IC50 303000±n/a nM
Citation Perdih, AHrast, MBarreteau, HGobec, SWolber, GSolmajer, T Benzene-1,3-dicarboxylic acid 2,5-dimethylpyrrole derivatives as multiple inhibitors of bacterial Mur ligases (MurC-MurF). Bioorg Med Chem22:4124-34 (2014) 
 
UDP-N-acetylmuramoyl-L-alanyl-D-glutamate--2,6-diaminopimelate ligase
Name:UDP-N-acetylmuramoyl-L-alanyl-D-glutamate--2,6-diaminopimelate ligase
Type:Protein
Mol. Mass.:53333.42
Organism:Escherichia coli UMNK88 (Enterobacteria)
Description:P22188
Residue:495
BDBM50046817
NameBDBM50046817
Synonyms:CHEMBL3310463
TypeSmall organic molecule
Emp. Form.C25H21N3O6S
Mol. Mass.491.516
SMILESCOc1ccc(cc1)\N=C1/NC(=O)\C(S1)=C/c1cc(C)n(c1C)-c1cc(cc(c1)C(O)=O)C(O)=O