Reaction Details
TargetSodium-dependent dopamine transporter
LigandBDBM50047420
Substrate/Competitorn/a
Meas. Tech.ChEMBL_1450235 (CHEMBL3376388)
Ki 290±n/a nM
Citation McCoull, WBarton, PBrown, AJBowker, SSCameron, JClarke, DSDavies, RDDossetter, AGErtan, AFenwick, MGreen, CHolmes, JLMartin, NMasters, DMoore, JENewcombe, NJNewton, CPointon, HRobb, GRSheldon, CStokes, SMorgan, D Identification, optimization, and pharmacology of acylurea GHS-R1a inverse agonists. J Med Chem57:6128-40 (2014) 
 
Sodium-dependent dopamine transporter
Name:Sodium-dependent dopamine transporter
Type:Multi-pass membrane protein
Mol. Mass.:68497.11
Organism:Homo sapiens (Human)
Description:Q01959
Residue:620
BDBM50047420
NameBDBM50047420
Synonyms:CHEMBL3319405
TypeSmall organic molecule
Emp. Form.C25H28ClN5O5S2
Mol. Mass.578.103
SMILESCN1CCC(CC1)S(=O)(=O)c1ccc2nc(NC(=O)NC(=O)c3cc(ccc3Cl)N3CCOCC3)sc2c1