Reaction Details
TargetGrowth hormone secretagogue receptor type 1
LigandBDBM50047428
Substrate/Competitorn/a
Meas. Tech.ChEMBL_1449409 (CHEMBL3373238)
IC50 0.570000±n/a nM
Citation McCoull, WBarton, PBrown, AJBowker, SSCameron, JClarke, DSDavies, RDDossetter, AGErtan, AFenwick, MGreen, CHolmes, JLMartin, NMasters, DMoore, JENewcombe, NJNewton, CPointon, HRobb, GRSheldon, CStokes, SMorgan, D Identification, optimization, and pharmacology of acylurea GHS-R1a inverse agonists. J Med Chem57:6128-40 (2014) 
 
Growth hormone secretagogue receptor type 1
Name:Growth hormone secretagogue receptor type 1
Type:Receptor
Mol. Mass.:41334.57
Organism:Homo sapiens (Human)
Description:Receptor binding studies use plasma membranes from LLC PK-1 cells transiently transfected with hGHSR1a.
Residue:366
BDBM50047428
NameBDBM50047428
Synonyms:CHEMBL3319399
TypeSmall organic molecule
Emp. Form.C26H29ClN6O4S2
Mol. Mass.589.129
SMILESCN1CCN(CCCS(=O)(=O)c2ccc3nc(NC(=O)NC(=O)c4cc5n(C)ccc5cc4Cl)sc3c2)CC1