Reaction Details
TargetGrowth hormone secretagogue receptor type 1
LigandBDBM50047474
Substrate/Competitorn/a
Meas. Tech.ChEMBL_1449409 (CHEMBL3373238)
IC50 0.480000±n/a nM
Citation McCoull, WBarton, PBrown, AJBowker, SSCameron, JClarke, DSDavies, RDDossetter, AGErtan, AFenwick, MGreen, CHolmes, JLMartin, NMasters, DMoore, JENewcombe, NJNewton, CPointon, HRobb, GRSheldon, CStokes, SMorgan, D Identification, optimization, and pharmacology of acylurea GHS-R1a inverse agonists. J Med Chem57:6128-40 (2014) 
 
Growth hormone secretagogue receptor type 1
Name:Growth hormone secretagogue receptor type 1
Type:Receptor
Mol. Mass.:41334.57
Organism:Homo sapiens (Human)
Description:Receptor binding studies use plasma membranes from LLC PK-1 cells transiently transfected with hGHSR1a.
Residue:366
BDBM50047474
NameBDBM50047474
Synonyms:CHEMBL3319228
TypeSmall organic molecule
Emp. Form.C27H30ClN7O4S2
Mol. Mass.616.155
SMILESCN1CCN(CCCS(=O)(=O)c2ccc3nc(NC(=O)NC(=O)c4ccc(cc4Cl)-n4ccc(C)n4)sc3c2)CC1