Reaction Details
TargetGrowth hormone secretagogue receptor type 1
LigandBDBM50047485
Substrate/Competitorn/a
Meas. Tech.ChEMBL_1449409 (CHEMBL3373238)
IC50 0.078000±n/a nM
Citation McCoull, WBarton, PBrown, AJBowker, SSCameron, JClarke, DSDavies, RDDossetter, AGErtan, AFenwick, MGreen, CHolmes, JLMartin, NMasters, DMoore, JENewcombe, NJNewton, CPointon, HRobb, GRSheldon, CStokes, SMorgan, D Identification, optimization, and pharmacology of acylurea GHS-R1a inverse agonists. J Med Chem57:6128-40 (2014) 
 
Growth hormone secretagogue receptor type 1
Name:Growth hormone secretagogue receptor type 1
Type:Receptor
Mol. Mass.:41334.57
Organism:Homo sapiens (Human)
Description:Receptor binding studies use plasma membranes from LLC PK-1 cells transiently transfected with hGHSR1a.
Residue:366
BDBM50047485
NameBDBM50047485
Synonyms:CHEMBL3319217
TypeSmall organic molecule
Emp. Form.C25H30ClN5O4S2
Mol. Mass.564.12
SMILESCCc1ccc(Cl)c(c1)C(=O)NC(=O)Nc1nc2ccc(cc2s1)S(=O)(=O)CCCN1CCN(C)CC1