Reaction Details
TargetMetabotropic glutamate receptor 5
LigandBDBM50047700
Substrate/Competitorn/a
Meas. Tech.ChEMBL_1451944 (CHEMBL3363388)
Ki 37±n/a nM
Citation Bates, BSRodriguez, ALFelts, ASMorrison, RDVenable, DFBlobaum, ALByers, FWLawson, KPDaniels, JSNiswender, CMJones, CKConn, PJLindsley, CWEmmitte, KA Discovery of VU0431316: a negative allosteric modulator of mGlu5 with activity in a mouse model of anxiety. Bioorg Med Chem Lett24:3307-14 (2014) 
 
Metabotropic glutamate receptor 5
Name:Metabotropic glutamate receptor 5
Type:Enzyme
Mol. Mass.:131900.14
Organism:Rattus norvegicus (Rat)
Description:P31424
Residue:1203
BDBM50047700
NameBDBM50047700
Synonyms:CHEMBL3314850
TypeSmall organic molecule
Emp. Form.C14H9ClN6O2
Mol. Mass.328.713
SMILESClc1ccnc(c1)C(=O)Nc1cncc(Oc2cncnc2)n1