Reaction Details
TargetC-X-C chemokine receptor type 2
LigandBDBM50048184
Substrate/Competitorn/a
Meas. Tech.ChEMBL_1456413 (CHEMBL3368862)
IC50 510±n/a nM
Citation Porter, DWBradley, MBrown, ZCharlton, SJCox, BHunt, PJanus, DLewis, SOakley, PO'Connor, DReilly, JSmith, NPress, NJ The discovery of potent, orally bioavailable pyrimidine-5-carbonitrile-6-alkyl CXCR2 receptor antagonists. Bioorg Med Chem Lett24:3285-90 (2014) 
 
C-X-C chemokine receptor type 2
Name:C-X-C chemokine receptor type 2
Type:Protein
Mol. Mass.:40767.88
Organism:Homo sapiens (Human)
Description:P25025
Residue:360
BDBM50048184
NameBDBM50048184
Synonyms:CHEMBL3310789
TypeSmall organic molecule
Emp. Form.C15H13N3OS
Mol. Mass.283.348
SMILESOc1nc(SCc2ccccc2)nc(C2CC2)c1C#N