Reaction Details
TargetC-X-C chemokine receptor type 2
LigandBDBM50048185
Substrate/Competitorn/a
Meas. Tech.ChEMBL_1456413 (CHEMBL3368862)
IC50 4800±n/a nM
Citation Porter, DWBradley, MBrown, ZCharlton, SJCox, BHunt, PJanus, DLewis, SOakley, PO'Connor, DReilly, JSmith, NPress, NJ The discovery of potent, orally bioavailable pyrimidine-5-carbonitrile-6-alkyl CXCR2 receptor antagonists. Bioorg Med Chem Lett24:3285-90 (2014) 
 
C-X-C chemokine receptor type 2
Name:C-X-C chemokine receptor type 2
Type:Protein
Mol. Mass.:40767.88
Organism:Homo sapiens (Human)
Description:P25025
Residue:360
BDBM50048185
NameBDBM50048185
Synonyms:CHEMBL3310790
TypeSmall organic molecule
Emp. Form.C16H15N3OS
Mol. Mass.297.375
SMILESCC(Sc1nc(O)c(C#N)c(n1)C1CC1)c1ccccc1