Reaction Details
TargetC-X-C chemokine receptor type 2
LigandBDBM50048227
Substrate/Competitorn/a
Meas. Tech.ChEMBL_1456414 (CHEMBL3368863)
IC50 4300±n/a nM
Citation Porter, DWBradley, MBrown, ZCharlton, SJCox, BHunt, PJanus, DLewis, SOakley, PO'Connor, DReilly, JSmith, NPress, NJ The discovery of potent, orally bioavailable pyrimidine-5-carbonitrile-6-alkyl CXCR2 receptor antagonists. Bioorg Med Chem Lett24:3285-90 (2014) 
 
C-X-C chemokine receptor type 2
Name:C-X-C chemokine receptor type 2
Type:Protein
Mol. Mass.:40767.88
Organism:Homo sapiens (Human)
Description:P25025
Residue:360
BDBM50048227
NameBDBM50048227
Synonyms:CHEMBL3310768
TypeSmall organic molecule
Emp. Form.C18H11Cl2N3OS
Mol. Mass.388.27
SMILESOc1nc(SCc2c(Cl)cccc2Cl)nc(-c2ccccc2)c1C#N