Reaction Details
TargetGlucocorticoid receptor
LigandBDBM50355735
Substrate/Competitorn/a
Meas. Tech.ChEMBL_1459132 (CHEMBL3370677)
Ki 1.9±n/a nM
Citation Gong, HYang, MXiao, ZDoweyko, AMCunningham, MWang, JHabte, SHolloway, DBurke, CShuster, DGao, LCarman, JSomerville, JENadler, SGSalter-Cid, LBarrish, JCWeinstein, DS Discovery of acylurea isosteres of 2-acylaminothiadiazole in the azaxanthene series of glucocorticoid receptor agonists. Bioorg Med Chem Lett24:3268-73 (2014) 
 
Glucocorticoid receptor
Name:Glucocorticoid receptor
Type:Enzyme
Mol. Mass.:85656.87
Organism:Homo sapiens (Human)
Description:P04150
Residue:777
BDBM50355735
NameBDBM50355735
Synonyms:CHEMBL1911270
TypeSmall organic molecule
Emp. Form.C27H25N5O3S
Mol. Mass.499.584
SMILESCN(C)C(=O)c1ccc(cc1)-c1ccc2[C@H](c3ccccc3Oc2n1)C(C)(C)C(=O)Nc1nncs1